Nderegistro,A�o,Mes,Origen,Edad,Barrio,EstadoCivil,Hijos,CantHijos,Uniones,TP1U,H1U,EV1U,TP2U,H2U,EV2U,TP3U,H3U,EV3U,Nacimiento,RedFamiliar,RedFamiliar2,RedAmistad,RedInstitucionl,AntecedentesMigratorios,Procedencia,Residencia,Permanencia,Migraci�nTemporaria,TenenciaVivienda,DisponibilidadHabit,Lectoescritura,NivEdCons,DificultadesEstudio,BeneficiariaPlanSocial,AUH,CantidadAUH,AntecedentesLab,CondLabConsul,CatOcupConsul,Tiempo�ltimoTrabajo,ProblemasLaborales,DisponibilidadIngresos,CoberturaSalud,Atenci�nM�dica,Enfermedades,Medicaci�nPs,ConsumoProblematico,Intervenci�nPs,Confusi�n,Angustia,Miedo,Ansiedad,Culpa,Indefenci�n,Sue�oAlimentaci�n,Suicidio,IntSuicidio,Tristeza,Verguenza,IntSaludMental,Intporlesiones,IntConsumoProb,Anticonceptivos,PrevETS,ControlClinico,ControlGinecolo,Embarazo,gestacion,Accesibilidad,ConsultasPrev,DerivadaGrupo,�reaPsic,�reaSocial,�reaLegal,�reaTO,Hogar,Maternaje,Demanda_espontanea,ArticEscuela,ArticConsul,ArticPolic�a,ArticPoderJudi,ArticInstONG,ArticSalud,ArticSerSoc,DenunciaReciente,DenunciaPrevia,CantidadDenuncias,Restricci�n,Exclusi�n,Restituci�n,reintegro,CumpRestric,CumpExclu,CumpRestitu,CumpReintegro,DesencadenaGolpesHijos,DesencadenaAbusoAcosoHijes,DesencadenaProbOtros,DesenadenaInfidelidad,DesencadenaPedidoHijo,DesencadenaSitL�mite,DesencadenaMiedo,DesencadenaLegal,DesencadenaOtro,MCf�sica,MCPsicologica,MCViolenciaSexual,MCViolenciaEc,MCPrivaci�nLibertad,MCAmenazas,MCEmbarazo,Antiguedad,Inicio,Cohabitaci�n,V�nculo,Asociaaembarazo,Asociacelos,Asociaproblemaslab,AsociaConsumoProb,AsociaAutonomia,AsociaSeparaci�n,AsociaSepaEl,AsociaInfidelidad,Guardia,SignosLesi�n,AmenazasArmas,Homicidio,Percepci�n,Incremento,AntecedentesVFlia,AntecedentesVFisPsic,AntecedentesViolaci�n,AntecedentesTestigo,AntecedentesAbandono,AntecedentesOtros,LectoescrituraAgresor,NivEdAgr,CondLabAgr,CatOcupAgr,ConsumoProblem�tico,AntecedentesJudiciales,Anteconotras,Detenci�n,OtrosMotivos,ViolFliaAgresorf�sPsic,ViolFliaAgresorAbuso,ViolFliaAgresorTestigo,ViolFliaagresorAbandono,EdadAgresor
1465,2019,2,2,55,96.0,1.00,2.00,,1.00,5.00,,1.00,,,,,,,2.00,2.00,2.00,2.00,2.00,2.00,,,,,2.00,2.00,1.00,3.00,2.00,2.00,,2.00,1.00,2.00,2.00,3.00,2.00,2.00,1.00,6.00,1.00,2.00,2.00,2.00,2.00,1.00,1.00,1.00,1.00,1.00,1.00,2.00,2.00,1.00,1.00,2.00,2.00,2.00,2.00,2.00,1.00,1.00,2.00,,1.00,2.00,2.00,2.00,1.00,1.00,2.00,2.00,2.00,,2.00,2.00,1.00,2.00,2.00,2.00,2.00,1.00,2.00,1.00,1.00,1.00,2.00,2.00,1.00,1.00,,,2.00,2.00,2.00,2.00,2.00,1.00,2.00,2.00,2.00,1.00,1.00,2.00,1.00,2.00,1.00,2.00,4.00,3.00,1.00,1.00,2.00,1.00,2.00,2.00,1.00,2.00,1.00,2.00,2.00,2.00,2.00,2.00,1.00,1.00,1.00,1.00,2.00,2.00,2.00,1.00,1.00,3.00,3.00,2.00,2.00,2.00,1.00,2.00,2.00,2.00,2.00,2.00,2.00,58.00
1466,2019,2,2,33,22.0,2.00,1.00,2.00,1.00,5.00,2.00,1.00,,,,,,,1.00,1.00,2.00,1.00,2.00,2.00,,,,,1.00,1.00,1.00,4.00,1.00,2.00,1.00,2.00,1.00,5.00,2.00,1.00,1.00,1.00,1.00,2.00,1.00,1.00,2.00,1.00,3.00,1.00,3.00,1.00,2.00,1.00,3.00,3.00,3.00,1.00,3.00,2.00,2.00,2.00,1.00,2.00,1.00,1.00,2.00,,5.00,2.00,2.00,1.00,2.00,1.00,2.00,2.00,2.00,,2.00,2.00,2.00,2.00,2.00,2.00,2.00,2.00,1.00,3.00,1.00,2.00,2.00,2.00,2.00,,,,2.00,2.00,2.00,2.00,2.00,1.00,1.00,1.00,2.00,1.00,1.00,1.00,2.00,2.00,1.00,1.00,4.00,5.00,2.00,11.00,1.00,1.00,2.00,2.00,2.00,2.00,2.00,2.00,2.00,2.00,1.00,1.00,1.00,2.00,2.00,,,,,,4.00,1.00,1.00,2.00,2.00,2.00,2.00,2.00,3.00,3.00,3.00,3.00,3.00,35.00
1467,2019,2,1,22,39.0,3.00,1.00,4.00,1.00,4.00,4.00,1.00,,,,,,,1.00,1.00,2.00,2.00,1.00,2.00,,,,,1.00,1.00,1.00,4.00,2.00,1.00,1.00,4.00,2.00,4.00,,,2.00,2.00,3.00,5.00,2.00,2.00,2.00,2.00,2.00,2.00,1.00,2.00,2.00,1.00,2.00,2.00,2.00,2.00,2.00,2.00,1.00,2.00,1.00,2.00,1.00,1.00,2.00,,5.00,2.00,2.00,1.00,1.00,1.00,1.00,1.00,1.00,,2.00,2.00,1.00,1.00,2.00,1.00,1.00,1.00,1.00,3.00,1.00,1.00,2.00,1.00,2.00,2.00,,1.00,2.00,2.00,2.00,2.00,2.00,1.00,1.00,2.00,2.00,1.00,1.00,2.00,2.00,2.00,1.00,2.00,3.00,4.00,1.00,1.00,2.00,2.00,2.00,1.00,2.00,2.00,1.00,2.00,1.00,2.00,2.00,2.00,2.00,2.00,2.00,,,,,,1.00,3.00,1.00,1.00,1.00,2.00,2.00,2.00,2.00,1.00,2.00,1.00,2.00,26.00
1468,2019,5,1,28,87.0,1.00,1.00,3.00,4.00,3.00,1.00,1.00,1.00,1.00,2.00,2.00,1.00,2.00,2.00,1.00,2.00,2.00,2.00,1.00,1.00,,1.00,2.00,3.00,2.00,1.00,4.00,2.00,2.00,2.00,,1.00,4.00,,3.00,2.00,1.00,3.00,2.00,2.00,2.00,1.00,1.00,2.00,1.00,1.00,1.00,2.00,2.00,2.00,2.00,2.00,1.00,2.00,2.00,2.00,1.00,1.00,1.00,2.00,2.00,2.00,,4.00,2.00,2.00,1.00,1.00,1.00,1.00,1.00,2.00,,2.00,2.00,2.00,1.00,2.00,2.00,2.00,1.00,2.00,1.00,1.00,21.00,2.00,2.00,2.00,,1.00,,2.00,2.00,2.00,2.00,2.00,1.00,1.00,2.00,2.00,1.00,1.00,2.00,2.00,2.00,2.00,2.00,1.00,1.00,1.00,1.00,2.00,2.00,2.00,1.00,2.00,2.00,2.00,2.00,2.00,1.00,2.00,2.00,1.00,1.00,1.00,2.00,1.00,2.00,1.00,2.00,1.00,6.00,2.00,1.00,1.00,3.00,3.00,2.00,2.00,2.00,2.00,1.00,2.00,41.00
1469,2019,4,1,52,118.0,3.00,1.00,3.00,3.00,3.00,2.00,1.00,5.00,1.00,2.00,4.00,,1.00,2.00,2.00,2.00,2.00,2.00,1.00,1.00,,4.00,2.00,3.00,2.00,1.00,6.00,2.00,2.00,2.00,,1.00,2.00,1.00,1.00,2.00,2.00,3.00,2.00,2.00,2.00,2.00,2.00,2.00,1.00,1.00,2.00,2.00,2.00,2.00,2.00,2.00,1.00,2.00,2.00,2.00,2.00,2.00,2.00,2.00,2.00,2.00,,4.00,2.00,2.00,1.00,1.00,1.00,1.00,1.00,2.00,,2.00,2.00,2.00,2.00,2.00,2.00,2.00,1.00,2.00,1.00,1.00,2.00,1.00,2.00,2.00,,1.00,,2.00,2.00,2.00,2.00,2.00,1.00,1.00,2.00,2.00,1.00,1.00,2.00,2.00,2.00,2.00,2.00,2.00,1.00,1.00,1.00,2.00,1.00,1.00,1.00,2.00,2.00,2.00,2.00,2.00,1.00,2.00,2.00,2.00,1.00,2.00,,,,,,1.00,3.00,2.00,1.00,1.00,2.00,3.00,3.00,3.00,2.00,2.00,2.00,2.00,39.00
1470,2019,4,1,20,109.0,1.00,2.00,,,,,,,,,,,,2.00,1.00,2.00,2.00,2.00,1.00,1.00,,1.00,1.00,8.00,2.00,1.00,1.00,2.00,1.00,1.00,1.00,2.00,2.00,,,2.00,1.00,3.00,2.00,2.00,1.00,2.00,1.00,2.00,2.00,2.00,2.00,2.00,2.00,2.00,2.00,2.00,2.00,2.00,2.00,2.00,2.00,2.00,1.00,1.00,1.00,2.00,,3.00,2.00,2.00,1.00,1.00,1.00,2.00,1.00,2.00,,2.00,2.00,2.00,2.00,2.00,2.00,2.00,1.00,2.00,1.00,1.00,2.00,1.00,2.00,1.00,,1.00,,2.00,1.00,2.00,2.00,2.00,1.00,2.00,2.00,2.00,1.00,1.00,1.00,2.00,2.00,1.00,2.00,1.00,1.00,2.00,11.00,2.00,2.00,2.00,1.00,1.00,2.00,2.00,2.00,1.00,2.00,2.00,2.00,1.00,1.00,1.00,1.00,1.00,2.00,2.00,2.00,1.00,7.00,1.00,1.00,1.00,3.00,3.00,3.00,3.00,3.00,3.00,3.00,3.00,50.00
1471,2019,4,1,19,20.0,3.00,1.00,1.00,3.00,1.00,1.00,,,,,,,,1.00,2.00,1.00,2.00,2.00,2.00,,,,,6.00,2.00,1.00,4.00,1.00,2.00,1.00,1.00,1.00,2.00,1.00,1.00,1.00,2.00,3.00,5.00,1.00,2.00,2.00,2.00,1.00,1.00,2.00,2.00,2.00,2.00,2.00,2.00,2.00,2.00,2.00,2.00,1.00,2.00,2.00,1.00,1.00,1.00,2.00,,5.00,2.00,2.00,1.00,1.00,2.00,2.00,2.00,1.00,,1.00,2.00,2.00,2.00,2.00,2.00,2.00,1.00,2.00,1.00,2.00,2.00,2.00,2.00,1.00,,,,1.00,1.00,2.00,2.00,2.00,2.00,2.00,2.00,2.00,1.00,1.00,1.00,1.00,1.00,1.00,1.00,2.00,3.00,2.00,11.00,2.00,1.00,2.00,1.00,1.00,2.00,1.00,2.00,2.00,1.00,1.00,2.00,1.00,1.00,1.00,1.00,2.00,1.00,1.00,2.00,1.00,4.00,2.00,2.00,1.00,2.00,1.00,3.00,3.00,1.00,3.00,1.00,2.00,21.00
1472,2019,4,1,23,74.0,3.00,1.00,2.00,2.00,4.00,1.00,2.00,4.00,1.00,1.00,,,,2.00,2.00,2.00,2.00,1.00,1.00,1.00,,4.00,2.00,3.00,2.00,1.00,,2.00,2.00,1.00,2.00,2.00,4.00,,,2.00,1.00,3.00,5.00,2.00,2.00,2.00,2.00,2.00,2.00,2.00,2.00,2.00,2.00,2.00,2.00,2.00,2.00,2.00,2.00,2.00,2.00,1.00,1.00,2.00,2.00,2.00,,5.00,2.00,2.00,1.00,1.00,1.00,1.00,1.00,1.00,,1.00,2.00,2.00,2.00,2.00,2.00,2.00,1.00,2.00,2.00,1.00,2.00,2.00,2.00,2.00,,,,2.00,2.00,2.00,2.00,2.00,2.00,1.00,1.00,2.00,1.00,1.00,2.00,1.00,2.00,2.00,2.00,3.00,4.00,1.00,1.00,2.00,1.00,2.00,1.00,1.00,2.00,2.00,2.00,2.00,2.00,1.00,1.00,1.00,1.00,1.00,1.00,1.00,1.00,2.00,2.00,1.00,3.00,1.00,2.00,1.00,2.00,1.00,3.00,1.00,1.00,2.00,1.00,3.00,25.00
1473,2019,3,1,21,111.0,3.00,1.00,1.00,1.00,4.00,1.00,1.00,,,,,,,2.00,1.00,2.00,1.00,2.00,1.00,1.00,,1.00,2.00,4.00,1.00,1.00,4.00,2.00,1.00,2.00,,1.00,2.00,4.00,1.00,2.00,1.00,3.00,5.00,2.00,2.00,2.00,2.00,2.00,1.00,1.00,2.00,2.00,2.00,2.00,2.00,2.00,1.00,2.00,2.00,2.00,2.00,2.00,2.00,1.00,1.00,2.00,,4.00,2.00,2.00,1.00,1.00,1.00,1.00,1.00,1.00,,2.00,2.00,2.00,2.00,2.00,2.00,1.00,1.00,1.00,3.00,1.00,2.00,1.00,2.00,2.00,,2.00,,1.00,2.00,2.00,2.00,2.00,1.00,1.00,2.00,2.00,1.00,1.00,2.00,1.00,1.00,1.00,1.00,2.00,3.00,1.00,1.00,2.00,1.00,2.00,1.00,2.00,2.00,2.00,2.00,1.00,2.00,1.00,2.00,1.00,1.00,1.00,1.00,2.00,1.00,2.00,2.00,1.00,3.00,1.00,1.00,1.00,1.00,1.00,2.00,1.00,3.00,3.00,1.00,3.00,24.00
1474,2019,3,1,33,120.0,3.00,1.00,6.00,4.00,3.00,3.00,1.00,2.00,1.00,1.00,2.00,1.00,2.00,2.00,1.00,2.00,2.00,2.00,1.00,1.00,,4.00,2.00,1.00,1.00,1.00,4.00,2.00,1.00,1.00,5.00,1.00,2.00,1.00,1.00,2.00,1.00,3.00,5.00,2.00,2.00,2.00,2.00,2.00,1.00,2.00,2.00,2.00,2.00,2.00,2.00,2.00,1.00,2.00,2.00,2.00,2.00,1.00,1.00,1.00,1.00,2.00,,4.00,2.00,2.00,1.00,1.00,1.00,1.00,1.00,1.00,,1.00,2.00,2.00,2.00,2.00,2.00,2.00,1.00,2.00,1.00,1.00,2.00,2.00,2.00,2.00,,,,2.00,2.00,2.00,2.00,2.00,1.00,1.00,2.00,2.00,1.00,1.00,2.00,2.00,2.00,2.00,1.00,2.00,3.00,1.00,1.00,2.00,2.00,2.00,1.00,2.00,2.00,2.00,2.00,2.00,2.00,2.00,2.00,1.00,1.00,1.00,2.00,2.00,1.00,2.00,2.00,1.00,5.00,1.00,1.00,1.00,1.00,3.00,2.00,1.00,2.00,2.00,1.00,2.00,29.00
1475,2019,3,1,33,52.0,3.00,1.00,3.00,3.00,1.00,1.00,1.00,2.00,1.00,1.00,4.00,1.00,1.00,4.00,1.00,2.00,2.00,2.00,1.00,3.00,1.00,2.00,1.00,6.00,2.00,1.00,2.00,2.00,2.00,2.00,,1.00,2.00,1.00,1.00,2.00,1.00,3.00,5.00,1.00,2.00,2.00,2.00,2.00,2.00,1.00,2.00,1.00,2.00,2.00,2.00,2.00,2.00,1.00,2.00,2.00,2.00,2.00,2.00,1.00,1.00,2.00,,4.00,2.00,2.00,1.00,1.00,1.00,2.00,1.00,2.00,,2.00,2.00,2.00,1.00,2.00,1.00,2.00,1.00,2.00,1.00,1.00,2.00,2.00,2.00,2.00,,,,2.00,2.00,2.00,2.00,2.00,2.00,2.00,2.00,1.00,1.00,1.00,2.00,2.00,2.00,2.00,2.00,2.00,2.00,1.00,1.00,2.00,2.00,2.00,1.00,2.00,2.00,2.00,2.00,2.00,2.00,2.00,2.00,2.00,1.00,1.00,1.00,2.00,2.00,2.00,2.00,1.00,3.00,1.00,1.00,2.00,2.00,2.00,2.00,2.00,1.00,2.00,2.00,2.00,36.00
1476,2019,3,1,29,69.0,3.00,1.00,3.00,1.00,5.00,3.00,1.00,,,,,,,1.00,1.00,1.00,2.00,2.00,2.00,,,,,7.00,1.00,1.00,6.00,1.00,2.00,2.00,,1.00,2.00,1.00,1.00,2.00,1.00,3.00,5.00,2.00,2.00,2.00,2.00,2.00,1.00,2.00,2.00,2.00,2.00,2.00,2.00,2.00,2.00,2.00,2.00,2.00,2.00,1.00,1.00,2.00,2.00,2.00,,4.00,2.00,2.00,1.00,1.00,1.00,1.00,1.00,2.00,,2.00,2.00,2.00,2.00,2.00,2.00,2.00,1.00,2.00,1.00,1.00,2.00,2.00,2.00,2.00,,,,2.00,2.00,2.00,2.00,2.00,1.00,1.00,2.00,2.00,1.00,1.00,2.00,1.00,2.00,1.00,2.00,4.00,3.00,1.00,4.00,2.00,2.00,2.00,1.00,2.00,2.00,2.00,2.00,2.00,2.00,2.00,2.00,1.00,1.00,2.00,,,,,,1.00,4.00,2.00,1.00,1.00,1.00,1.00,1.00,1.00,2.00,2.00,2.00,2.00,22.00
1477,2019,2,2,59,,1.00,2.00,,1.00,4.00,,1.00,,,,,,,3.00,2.00,2.00,2.00,2.00,1.00,2.00,,1.00,2.00,8.00,2.00,1.00,5.00,2.00,2.00,,,1.00,2.00,1.00,3.00,2.00,2.00,3.00,2.00,2.00,1.00,2.00,2.00,2.00,1.00,2.00,1.00,2.00,2.00,2.00,2.00,2.00,1.00,2.00,2.00,2.00,2.00,2.00,2.00,2.00,2.00,2.00,,4.00,2.00,2.00,1.00,1.00,1.00,1.00,1.00,2.00,,2.00,2.00,2.00,2.00,2.00,2.00,2.00,1.00,2.00,1.00,1.00,2.00,2.00,2.00,2.00,,,,2.00,2.00,2.00,2.00,2.00,1.00,1.00,2.00,2.00,1.00,1.00,1.00,1.00,2.00,1.00,2.00,3.00,4.00,1.00,1.00,2.00,1.00,2.00,1.00,1.00,2.00,2.00,2.00,2.00,2.00,2.00,2.00,1.00,1.00,2.00,,,,,,1.00,3.00,1.00,1.00,1.00,2.00,1.00,2.00,2.00,3.00,3.00,3.00,3.00,61.00
1478,2019,2,2,35,42.0,2.00,1.00,4.00,3.00,2.00,1.00,2.00,3.00,1.00,2.00,4.00,2.00,1.00,1.00,1.00,1.00,1.00,2.00,2.00,,,,,7.00,1.00,1.00,4.00,2.00,2.00,1.00,3.00,1.00,2.00,1.00,2.00,2.00,1.00,3.00,2.00,2.00,2.00,2.00,1.00,2.00,2.00,2.00,1.00,2.00,2.00,1.00,2.00,2.00,1.00,2.00,2.00,2.00,2.00,2.00,2.00,2.00,2.00,2.00,,4.00,1.00,1.00,1.00,1.00,2.00,2.00,2.00,2.00,,2.00,2.00,2.00,2.00,2.00,2.00,2.00,1.00,1.00,3.00,1.00,1.00,2.00,2.00,2.00,1.00,,,2.00,2.00,2.00,2.00,2.00,1.00,1.00,2.00,2.00,1.00,1.00,2.00,2.00,2.00,1.00,1.00,3.00,4.00,2.00,11.00,1.00,2.00,2.00,1.00,2.00,2.00,2.00,2.00,1.00,2.00,1.00,1.00,1.00,1.00,1.00,2.00,2.00,1.00,2.00,2.00,1.00,4.00,5.00,2.00,1.00,1.00,1.00,2.00,1.00,1.00,3.00,3.00,3.00,37.00
1479,2019,2,3,30,26.0,1.00,1.00,2.00,2.00,3.00,2.00,1.00,3.00,,1.00,,,,1.00,1.00,2.00,2.00,2.00,2.00,,,,,6.00,1.00,1.00,3.00,2.00,1.00,1.00,1.00,1.00,2.00,1.00,3.00,2.00,1.00,3.00,5.00,1.00,2.00,2.00,2.00,2.00,1.00,1.00,1.00,2.00,1.00,2.00,2.00,2.00,1.00,2.00,2.00,2.00,2.00,1.00,1.00,1.00,2.00,2.00,,3.00,2.00,2.00,2.00,2.00,2.00,1.00,2.00,2.00,,2.00,2.00,2.00,2.00,2.00,2.00,2.00,1.00,1.00,3.00,1.00,2.00,2.00,2.00,1.00,,,,2.00,2.00,2.00,2.00,2.00,1.00,1.00,2.00,2.00,1.00,1.00,1.00,1.00,1.00,1.00,2.00,2.00,2.00,2.00,11.00,2.00,1.00,2.00,1.00,2.00,2.00,1.00,2.00,2.00,2.00,1.00,1.00,1.00,1.00,1.00,1.00,2.00,1.00,2.00,2.00,1.00,4.00,1.00,1.00,1.00,1.00,3.00,3.00,3.00,1.00,2.00,1.00,2.00,25.00
1480,2019,2,2,15,10.0,1.00,2.00,,1.00,3.00,,1.00,,,,,,,5.00,1.00,1.00,1.00,2.00,1.00,4.00,1.00,4.00,2.00,4.00,1.00,1.00,4.00,2.00,2.00,2.00,,2.00,4.00,,,,,1.00,6.00,1.00,2.00,2.00,2.00,2.00,2.00,2.00,2.00,2.00,2.00,2.00,2.00,2.00,1.00,2.00,2.00,2.00,2.00,1.00,1.00,3.00,3.00,2.00,,1.00,2.00,2.00,1.00,1.00,1.00,1.00,2.00,2.00,,2.00,2.00,2.00,2.00,2.00,2.00,2.00,1.00,2.00,1.00,1.00,2.00,2.00,2.00,1.00,,,,1.00,2.00,1.00,2.00,2.00,1.00,1.00,2.00,2.00,2.00,1.00,2.00,2.00,2.00,2.00,2.00,2.00,3.00,2.00,11.00,2.00,1.00,2.00,2.00,1.00,2.00,2.00,2.00,2.00,2.00,2.00,2.00,2.00,1.00,1.00,2.00,2.00,1.00,2.00,2.00,1.00,4.00,1.00,2.00,2.00,2.00,3.00,2.00,2.00,1.00,2.00,1.00,2.00,19.00
1481,2019,2,2,64,11.0,3.00,1.00,5.00,3.00,3.00,2.00,2.00,5.00,3.00,1.00,5.00,,1.00,1.00,1.00,1.00,1.00,2.00,2.00,,,,,1.00,1.00,1.00,2.00,2.00,2.00,2.00,,1.00,3.00,1.00,3.00,2.00,1.00,1.00,6.00,2.00,2.00,2.00,1.00,2.00,1.00,1.00,2.00,2.00,1.00,2.00,1.00,1.00,1.00,2.00,1.00,1.00,2.00,2.00,2.00,1.00,1.00,2.00,,3.00,1.00,2.00,1.00,1.00,1.00,1.00,2.00,2.00,,2.00,2.00,2.00,2.00,2.00,2.00,2.00,1.00,1.00,3.00,1.00,1.00,2.00,2.00,2.00,2.00,,,2.00,2.00,2.00,2.00,2.00,1.00,1.00,2.00,2.00,1.00,1.00,2.00,1.00,2.00,1.00,2.00,4.00,5.00,2.00,11.00,2.00,1.00,2.00,1.00,1.00,2.00,1.00,1.00,1.00,2.00,1.00,1.00,1.00,1.00,1.00,2.00,2.00,1.00,2.00,2.00,1.00,3.00,1.00,1.00,1.00,1.00,1.00,1.00,2.00,2.00,2.00,2.00,1.00,54.00
1482,2019,2,2,42,36.0,3.00,1.00,2.00,2.00,4.00,1.00,2.00,5.00,1.00,1.00,,,,3.00,1.00,1.00,2.00,2.00,1.00,2.00,1.00,4.00,2.00,7.00,1.00,2.00,1.00,2.00,2.00,1.00,2.00,2.00,4.00,,,2.00,2.00,3.00,5.00,2.00,1.00,2.00,1.00,2.00,1.00,1.00,1.00,2.00,1.00,1.00,1.00,1.00,1.00,1.00,1.00,2.00,2.00,2.00,2.00,2.00,2.00,2.00,,1.00,2.00,2.00,2.00,2.00,2.00,1.00,2.00,2.00,,2.00,2.00,2.00,2.00,2.00,2.00,2.00,1.00,1.00,3.00,1.00,1.00,2.00,2.00,2.00,1.00,,,1.00,1.00,2.00,2.00,1.00,1.00,1.00,2.00,2.00,1.00,1.00,1.00,1.00,1.00,1.00,1.00,4.00,5.00,2.00,11.00,1.00,1.00,2.00,2.00,1.00,2.00,1.00,2.00,2.00,1.00,1.00,1.00,1.00,1.00,2.00,,,,,,2.00,1.00,1.00,1.00,2.00,1.00,1.00,2.00,1.00,1.00,2.00,1.00,2.00,43.00
1483,2019,2,2,48,99.0,2.00,2.00,,1.00,5.00,,1.00,,,,,,,3.00,2.00,2.00,1.00,2.00,1.00,2.00,,4.00,2.00,3.00,2.00,1.00,7.00,1.00,2.00,,,1.00,2.00,1.00,3.00,2.00,2.00,2.00,6.00,2.00,2.00,2.00,2.00,2.00,1.00,2.00,2.00,1.00,2.00,2.00,2.00,2.00,1.00,2.00,1.00,2.00,2.00,2.00,2.00,2.00,2.00,2.00,,5.00,2.00,2.00,2.00,2.00,2.00,1.00,2.00,2.00,,2.00,2.00,2.00,2.00,2.00,1.00,2.00,2.00,2.00,,,,,,,,,,2.00,2.00,2.00,2.00,2.00,2.00,2.00,2.00,2.00,2.00,1.00,2.00,2.00,1.00,2.00,2.00,4.00,2.00,1.00,1.00,2.00,2.00,2.00,2.00,2.00,2.00,2.00,2.00,2.00,2.00,2.00,2.00,2.00,2.00,2.00,,,,,,1.00,5.00,1.00,1.00,2.00,2.00,2.00,2.00,2.00,2.00,2.00,3.00,3.00,52.00
1484,2019,2,2,40,38.0,3.00,1.00,1.00,3.00,3.00,,2.00,3.00,,1.00,5.00,,1.00,1.00,1.00,2.00,1.00,2.00,2.00,,,,,4.00,1.00,1.00,7.00,2.00,2.00,2.00,,1.00,1.00,3.00,2.00,1.00,1.00,2.00,6.00,2.00,1.00,1.00,1.00,1.00,2.00,1.00,1.00,2.00,1.00,2.00,2.00,2.00,2.00,1.00,2.00,2.00,2.00,1.00,1.00,2.00,1.00,2.00,,1.00,2.00,2.00,2.00,2.00,1.00,2.00,2.00,2.00,,2.00,2.00,2.00,1.00,2.00,2.00,2.00,1.00,1.00,2.00,2.00,2.00,2.00,2.00,,,,,1.00,2.00,1.00,2.00,1.00,2.00,2.00,2.00,1.00,2.00,1.00,2.00,1.00,1.00,1.00,1.00,4.00,3.00,3.00,11.00,1.00,1.00,2.00,1.00,1.00,2.00,1.00,2.00,2.00,2.00,2.00,2.00,2.00,2.00,2.00,,,,,,1.00,7.00,6.00,6.00,1.00,1.00,1.00,1.00,3.00,3.00,3.00,3.00,3.00,43.00
1485,2019,2,2,23,51.0,1.00,1.00,1.00,2.00,3.00,,2.00,3.00,,2.00,,,,3.00,2.00,2.00,2.00,2.00,1.00,2.00,,3.00,2.00,4.00,1.00,1.00,6.00,2.00,2.00,1.00,1.00,1.00,2.00,1.00,3.00,2.00,2.00,3.00,2.00,2.00,2.00,2.00,1.00,1.00,1.00,2.00,2.00,1.00,2.00,2.00,2.00,2.00,2.00,2.00,2.00,2.00,2.00,1.00,1.00,2.00,2.00,2.00,,5.00,2.00,2.00,2.00,2.00,1.00,2.00,2.00,2.00,,2.00,2.00,2.00,2.00,2.00,2.00,2.00,2.00,2.00,,,,,,,,,,2.00,2.00,2.00,2.00,2.00,2.00,2.00,2.00,1.00,2.00,2.00,2.00,2.00,2.00,2.00,2.00,4.00,5.00,2.00,3.00,2.00,2.00,2.00,1.00,2.00,2.00,2.00,2.00,2.00,2.00,2.00,2.00,2.00,2.00,1.00,1.00,1.00,2.00,2.00,2.00,1.00,5.00,1.00,1.00,3.00,2.00,2.00,2.00,2.00,1.00,1.00,2.00,2.00,
1486,2019,2,2,35,23.0,3.00,1.00,3.00,1.00,5.00,3.00,1.00,,,,,,,2.00,2.00,2.00,1.00,1.00,1.00,1.00,,4.00,2.00,4.00,1.00,1.00,3.00,2.00,2.00,1.00,3.00,1.00,2.00,5.00,1.00,2.00,2.00,3.00,5.00,2.00,2.00,2.00,2.00,2.00,2.00,2.00,2.00,2.00,1.00,1.00,2.00,2.00,1.00,1.00,2.00,2.00,2.00,2.00,2.00,2.00,2.00,2.00,,5.00,2.00,2.00,2.00,1.00,2.00,1.00,2.00,2.00,,1.00,2.00,2.00,2.00,2.00,1.00,2.00,1.00,1.00,3.00,1.00,2.00,2.00,2.00,1.00,,,,2.00,2.00,1.00,1.00,1.00,2.00,2.00,2.00,1.00,2.00,2.00,2.00,2.00,2.00,2.00,2.00,4.00,5.00,2.00,11.00,2.00,1.00,2.00,1.00,2.00,1.00,1.00,1.00,1.00,1.00,2.00,2.00,1.00,1.00,1.00,1.00,2.00,1.00,1.00,1.00,1.00,4.00,5.00,2.00,3.00,2.00,3.00,2.00,3.00,1.00,2.00,1.00,2.00,35.00
1487,2019,2,2,50,17.0,2.00,2.00,,1.00,3.00,,1.00,,,,,,,3.00,1.00,2.00,1.00,2.00,2.00,2.00,,2.00,2.00,1.00,2.00,1.00,7.00,2.00,2.00,,,1.00,5.00,2.00,3.00,1.00,1.00,3.00,5.00,2.00,2.00,2.00,2.00,2.00,1.00,2.00,1.00,2.00,1.00,1.00,2.00,2.00,1.00,1.00,2.00,2.00,2.00,2.00,2.00,1.00,1.00,2.00,,1.00,2.00,2.00,1.00,2.00,2.00,2.00,2.00,2.00,,2.00,2.00,2.00,2.00,2.00,2.00,2.00,1.00,2.00,1.00,1.00,1.00,2.00,2.00,1.00,1.00,,,2.00,2.00,2.00,1.00,2.00,2.00,2.00,1.00,2.00,2.00,1.00,2.00,1.00,2.00,1.00,2.00,2.00,2.00,2.00,11.00,2.00,2.00,1.00,2.00,2.00,2.00,1.00,1.00,2.00,2.00,2.00,2.00,2.00,1.00,1.00,2.00,2.00,1.00,2.00,2.00,1.00,5.00,1.00,1.00,3.00,3.00,3.00,3.00,2.00,3.00,3.00,3.00,3.00,50.00
1488,2019,2,2,50,65.0,2.00,2.00,,1.00,5.00,,1.00,,,,,,,3.00,1.00,2.00,1.00,2.00,1.00,2.00,,4.00,2.00,3.00,1.00,1.00,4.00,2.00,2.00,,,1.00,2.00,2.00,3.00,2.00,2.00,1.00,6.00,2.00,2.00,2.00,2.00,2.00,1.00,2.00,1.00,2.00,2.00,2.00,2.00,2.00,1.00,1.00,2.00,2.00,2.00,2.00,2.00,1.00,1.00,2.00,,2.00,2.00,2.00,1.00,1.00,2.00,1.00,2.00,2.00,,2.00,2.00,2.00,2.00,2.00,2.00,2.00,2.00,2.00,,,,,,,,,,2.00,2.00,1.00,2.00,2.00,2.00,2.00,2.00,1.00,2.00,1.00,2.00,1.00,2.00,2.00,2.00,4.00,5.00,1.00,1.00,2.00,2.00,2.00,1.00,2.00,2.00,1.00,2.00,2.00,2.00,2.00,2.00,2.00,2.00,1.00,1.00,2.00,2.00,2.00,2.00,1.00,8.00,3.00,7.00,1.00,3.00,3.00,2.00,3.00,1.00,3.00,1.00,3.00,63.00
1489,2019,2,2,37,26.0,2.00,1.00,3.00,1.00,5.00,3.00,1.00,,,,,,,2.00,1.00,1.00,2.00,2.00,1.00,1.00,,4.00,2.00,1.00,2.00,1.00,4.00,2.00,2.00,,2.00,1.00,1.00,1.00,,1.00,2.00,3.00,5.00,2.00,2.00,2.00,2.00,1.00,1.00,1.00,1.00,1.00,1.00,2.00,2.00,2.00,1.00,1.00,2.00,2.00,2.00,2.00,2.00,2.00,2.00,2.00,,1.00,2.00,1.00,1.00,2.00,2.00,2.00,2.00,1.00,,1.00,2.00,1.00,2.00,2.00,2.00,2.00,1.00,2.00,1.00,1.00,2.00,2.00,2.00,2.00,,,,1.00,2.00,1.00,2.00,1.00,1.00,1.00,2.00,1.00,1.00,1.00,1.00,2.00,1.00,1.00,2.00,4.00,5.00,2.00,11.00,2.00,1.00,2.00,1.00,1.00,2.00,1.00,2.00,2.00,2.00,1.00,1.00,2.00,1.00,1.00,2.00,1.00,2.00,2.00,2.00,1.00,3.00,1.00,1.00,3.00,1.00,3.00,2.00,2.00,1.00,2.00,1.00,3.00,36.00
1490,2019,2,2,49,66.0,4.00,1.00,2.00,1.00,5.00,2.00,1.00,,,,,,,1.00,2.00,2.00,1.00,2.00,2.00,,,,,7.00,1.00,1.00,3.00,2.00,2.00,2.00,,1.00,2.00,1.00,3.00,1.00,2.00,3.00,2.00,2.00,2.00,2.00,2.00,1.00,2.00,1.00,1.00,2.00,2.00,2.00,2.00,2.00,2.00,2.00,2.00,2.00,2.00,2.00,2.00,1.00,1.00,2.00,,2.00,2.00,2.00,1.00,2.00,2.00,2.00,2.00,2.00,,2.00,2.00,2.00,2.00,2.00,2.00,2.00,1.00,1.00,2.00,1.00,2.00,2.00,2.00,2.00,,,,2.00,2.00,2.00,1.00,2.00,1.00,1.00,2.00,2.00,1.00,1.00,1.00,2.00,2.00,1.00,2.00,4.00,5.00,2.00,11.00,2.00,1.00,2.00,2.00,2.00,2.00,2.00,2.00,2.00,2.00,2.00,2.00,1.00,1.00,1.00,1.00,2.00,2.00,2.00,2.00,1.00,3.00,1.00,2.00,2.00,2.00,2.00,2.00,2.00,2.00,2.00,2.00,2.00,54.00
1491,2019,3,2,26,6.0,3.00,1.00,1.00,1.00,3.00,1.00,1.00,,,,,,,1.00,1.00,1.00,1.00,2.00,2.00,,,,,4.00,2.00,1.00,4.00,1.00,2.00,1.00,1.00,1.00,2.00,5.00,1.00,2.00,1.00,3.00,5.00,2.00,2.00,2.00,2.00,2.00,1.00,1.00,1.00,1.00,1.00,1.00,1.00,1.00,1.00,1.00,2.00,2.00,2.00,1.00,2.00,2.00,2.00,2.00,,5.00,2.00,2.00,2.00,1.00,2.00,2.00,2.00,2.00,,2.00,2.00,2.00,2.00,2.00,1.00,2.00,1.00,2.00,1.00,1.00,1.00,2.00,2.00,2.00,2.00,,,2.00,2.00,1.00,2.00,2.00,1.00,1.00,2.00,2.00,1.00,1.00,1.00,1.00,1.00,1.00,1.00,2.00,3.00,2.00,11.00,2.00,1.00,2.00,1.00,1.00,2.00,1.00,2.00,2.00,1.00,1.00,1.00,1.00,1.00,2.00,,,,,,1.00,3.00,1.00,1.00,1.00,1.00,1.00,1.00,1.00,3.00,3.00,3.00,3.00,
1492,2019,3,2,42,118.0,4.00,1.00,4.00,2.00,2.00,1.00,2.00,5.00,3.00,1.00,,,,1.00,1.00,1.00,1.00,2.00,2.00,,,,,4.00,1.00,1.00,4.00,2.00,2.00,2.00,,1.00,5.00,1.00,1.00,2.00,1.00,1.00,6.00,2.00,1.00,2.00,1.00,2.00,1.00,1.00,1.00,1.00,1.00,2.00,1.00,1.00,1.00,2.00,2.00,2.00,2.00,2.00,2.00,2.00,2.00,2.00,,1.00,2.00,2.00,2.00,1.00,2.00,2.00,2.00,2.00,,2.00,2.00,2.00,2.00,2.00,2.00,2.00,1.00,2.00,2.00,1.00,2.00,2.00,2.00,1.00,,,,2.00,2.00,2.00,2.00,2.00,1.00,2.00,2.00,2.00,1.00,1.00,2.00,1.00,2.00,1.00,2.00,4.00,5.00,2.00,11.00,2.00,2.00,2.00,1.00,2.00,2.00,2.00,2.00,2.00,2.00,2.00,2.00,2.00,1.00,2.00,,,,,,1.00,4.00,6.00,7.00,1.00,2.00,3.00,2.00,3.00,3.00,3.00,3.00,3.00,39.00
1493,2019,3,2,32,55.0,2.00,1.00,2.00,1.00,3.00,2.00,1.00,,,,,,,5.00,2.00,2.00,2.00,2.00,1.00,4.00,1.00,2.00,2.00,3.00,2.00,1.00,7.00,2.00,2.00,2.00,,1.00,2.00,3.00,3.00,2.00,2.00,3.00,4.00,2.00,2.00,2.00,2.00,2.00,1.00,1.00,2.00,1.00,1.00,2.00,2.00,2.00,1.00,1.00,2.00,2.00,2.00,1.00,2.00,1.00,1.00,2.00,,2.00,1.00,1.00,1.00,2.00,2.00,2.00,2.00,2.00,,2.00,2.00,2.00,2.00,2.00,2.00,2.00,2.00,2.00,,,,,,,,,,2.00,2.00,2.00,2.00,2.00,1.00,1.00,1.00,2.00,1.00,1.00,2.00,1.00,2.00,1.00,1.00,2.00,3.00,1.00,1.00,2.00,1.00,2.00,2.00,1.00,2.00,2.00,2.00,2.00,2.00,2.00,2.00,1.00,2.00,2.00,,,,,,1.00,6.00,1.00,2.00,2.00,2.00,2.00,2.00,2.00,2.00,2.00,1.00,1.00,30.00
1494,2019,3,2,54,40.0,3.00,1.00,12.00,2.00,5.00,9.00,2.00,5.00,3.00,1.00,,,,2.00,1.00,2.00,2.00,1.00,1.00,1.00,,4.00,2.00,3.00,1.00,1.00,4.00,2.00,2.00,1.00,,1.00,5.00,1.00,1.00,1.00,2.00,3.00,5.00,2.00,2.00,2.00,2.00,2.00,1.00,1.00,2.00,2.00,2.00,1.00,2.00,2.00,1.00,1.00,2.00,2.00,2.00,1.00,1.00,1.00,1.00,2.00,,5.00,2.00,2.00,1.00,1.00,1.00,2.00,2.00,2.00,,2.00,2.00,2.00,2.00,2.00,2.00,1.00,1.00,2.00,2.00,1.00,2.00,2.00,2.00,2.00,,,,2.00,2.00,1.00,2.00,2.00,2.00,1.00,2.00,2.00,1.00,1.00,1.00,1.00,1.00,1.00,1.00,4.00,5.00,2.00,11.00,1.00,2.00,2.00,1.00,2.00,2.00,2.00,2.00,2.00,1.00,2.00,2.00,1.00,1.00,1.00,1.00,2.00,2.00,1.00,2.00,1.00,4.00,5.00,1.00,1.00,1.00,1.00,2.00,1.00,1.00,2.00,1.00,2.00,51.00
1495,2019,3,2,59,65.0,3.00,1.00,12.00,2.00,2.00,2.00,2.00,5.00,10.00,1.00,,,,3.00,1.00,1.00,2.00,2.00,1.00,2.00,,4.00,2.00,7.00,1.00,1.00,5.00,2.00,1.00,2.00,,1.00,5.00,2.00,3.00,2.00,1.00,3.00,5.00,2.00,2.00,2.00,2.00,2.00,1.00,1.00,2.00,2.00,2.00,2.00,2.00,2.00,1.00,2.00,2.00,2.00,2.00,2.00,2.00,2.00,2.00,2.00,,4.00,2.00,1.00,1.00,2.00,2.00,2.00,2.00,2.00,,2.00,2.00,2.00,2.00,2.00,2.00,2.00,1.00,1.00,2.00,1.00,1.00,2.00,2.00,1.00,2.00,,,2.00,2.00,2.00,2.00,2.00,1.00,2.00,1.00,2.00,1.00,1.00,1.00,2.00,2.00,1.00,1.00,4.00,5.00,2.00,11.00,2.00,2.00,2.00,2.00,1.00,2.00,2.00,1.00,1.00,1.00,1.00,2.00,1.00,1.00,1.00,2.00,2.00,1.00,2.00,2.00,1.00,5.00,1.00,1.00,2.00,1.00,1.00,1.00,3.00,1.00,3.00,3.00,3.00,63.00